Jump to content

DeathBringer

Members
  • Content count

    14
  • Joined

  • Last visited

Community Reputation

0 Neutral

About DeathBringer

  • Rank
    Newbie

Profile Information

  • Gender
    Male
  • Server
    NA
  • Location
    Austin, TX

Recent Profile Visitors

297 profile views
  1. AVG halted my install

    Yeah, I Installed it. I have ESET on my gaming laptop and it installed fine. I guess I have to get another license to install ESET on my gaming desktop :-) At least I gave you a giggle today..lol Peace!!
  2. AVG halted my install

    First for me.. but AVG popped up this window and stopped my install unless I manually clicked Trusted File. Anyone have this with other AV's? False positive I guess?
  3. These only appear after installing the modpack. The log is full of them . Anything I should be concerned about. Using Gnomefathers option: 2017-05-17 18:20:34.586: ERROR: Traceback (most recent call last): 2017-05-17 18:20:34.586: ERROR: File "mods/xfw/python/xfw/wwise.py", line 163, in _bank_load 2017-05-17 18:20:34.586: ERROR: RuntimeError: [LoadBank] Cannot link or copy bank file. 2017-05-17 18:20:44.485: NOTICE: [NOTE] (scripts/client/game.py, 459): [SPACE] Loading space: spaces/hangar_premium_v2 2017-05-17 18:21:05.713: ERROR: Traceback (most recent call last): 2017-05-17 18:21:05.713: ERROR: File "mods/xfw/python/xfw/wwise.py", line 163, in _bank_load 2017-05-17 18:21:05.713: ERROR: RuntimeError: [LoadBank] Cannot link or copy bank file. 2017-05-17 18:21:06.346: NOTICE: [NOTE] (scripts/client/game.py, 459): [SPACE] Loading space: spaces/13_erlenberg 2017-05-17 18:21:07.445: WARNING: [WARNING] (scripts/client/gui/Scaleform/framework/entities/BaseDAAPIComponent.py, 62): Class with alias `teamBasesPanel` already registered in object <gui.Scaleform.daapi.view.battle.classic.page.ClassicPage object at 0x82437230>. It will be rewritten. 2017-05-17 18:21:12.615: INFO: [SOUND_ERROR] Sound fail: 2967843034 - ErrorCode: 15 2017-05-17 18:22:19.398: INFO: [SOUND_ERROR] Sound fail: 1650177404 - ErrorCode: 15 2017-05-17 18:22:21.381: INFO: [SOUND_ERROR] Sound fail: 1650177404 - ErrorCode: 15 2017-05-17 18:22:21.586: INFO: [SOUND_ERROR] Sound fail: 1650177404 - ErrorCode: 15 2017-05-17 18:22:32.902: INFO: [SOUND_ERROR] Sound fail: 1549628374 - ErrorCode: 15 2017-05-17 18:22:35.301: INFO: [SOUND_ERROR] Sound fail: 1650177404 - ErrorCode: 15 2017-05-17 18:22:38.199: INFO: [SOUND_ERROR] Sound fail: 1650177404 - ErrorCode: 15 2017-05-17 18:22:39.190: INFO: [SOUND_ERROR] Sound fail: 1650177404 - ErrorCode: 15 2017-05-17 18:22:57.086: INFO: [SOUND_ERROR] Sound fail: 1549628374 - ErrorCode: 15 2017-05-17 18:22:58.292: INFO: [SOUND_ERROR] Sound fail: 1549628374 - ErrorCode: 15 2017-05-17 18:23:07.094: INFO: [SOUND_ERROR] Sound fail: 1650177404 - ErrorCode: 15 2017-05-17 18:23:09.395: INFO: [SOUND_ERROR] Sound fail: 1650177404 - ErrorCode: 15 2017-05-17 18:23:19.407: INFO: [SOUND_ERROR] Sound fail: 1650177404 - ErrorCode: 15 2017-05-17 18:23:20.104: INFO: [SOUND_ERROR] Sound fail: 1650177404 - ErrorCode: 15 2017-05-17 18:23:23.507: INFO: [SOUND_ERROR] Sound fail: 1549628374 - ErrorCode: 15 2017-05-17 18:23:24.990: INFO: [SOUND_ERROR] Sound fail: 1650177404 - ErrorCode: 15 2017-05-17 18:23:29.596: INFO: [SOUND_ERROR] Sound fail: 1549628374 - ErrorCode: 15 2017-05-17 18:23:33.409: INFO: [SOUND_ERROR] Sound fail: 1650177404 - ErrorCode: 15 2017-05-17 18:23:35.401: INFO: [SOUND_ERROR] Sound fail: 1650177404 - ErrorCode: 15 2017-05-17 18:24:00.093: INFO: [SOUND_ERROR] Sound fail: 1549628374 - ErrorCode: 15 2017-05-17 18:24:20.693: INFO: [SOUND_ERROR] Sound fail: 1549628374 - ErrorCode: 15 2017-05-17 18:24:26.782: INFO: [SOUND_ERROR] Sound fail: 1549628374 - ErrorCode: 15 2017-05-17 18:24:33.193: INFO: [SOUND_ERROR] Sound fail: 1549628374 - ErrorCode: 15 2017-05-17 18:24:46.516: INFO: [SOUND_ERROR] Sound fail: 1549628374 - ErrorCode: 15 2017-05-17 18:24:58.797: INFO: [SOUND_ERROR] Sound fail: 1650177404 - ErrorCode: 15 2017-05-17 18:25:02.598: INFO: [SOUND_ERROR] Sound fail: 1549628374 - ErrorCode: 15 2017-05-17 18:25:05.407: INFO: [SOUND_ERROR] Sound fail: 1549628374 - ErrorCode: 15 2017-05-17 18:25:26.291: INFO: [SOUND_ERROR] Sound fail: 1650177404 - ErrorCode: 15 2017-05-17 18:25:32.596: INFO: [SOUND_ERROR] Sound fail: 1549628374 - ErrorCode: 15 2017-05-17 18:26:18.000: INFO: [SOUND_ERROR] Sound fail: 1549628374 - ErrorCode: 15 2017-05-17 18:26:28.837: ERROR: Traceback (most recent call last): 2017-05-17 18:26:28.837: ERROR: File "mods/xfw/python/xfw/wwise.py", line 163, in _bank_load 2017-05-17 18:26:28.837: ERROR: RuntimeError: [LoadBank] Cannot link or copy bank file. 2017-05-17 18:26:32.104: NOTICE: [NOTE] (scripts/client/game.py, 459): [SPACE] Loading space: spaces/hangar_premium_v2 2017-05-17 18:26:37.914: WARNING: [WARNING] (scripts/client/account_helpers/CustomFilesCache.py, 36): Method "close" takes too much time 0.97200012207 2017-05-17 18:26:38.000: INFO: PostProcessing.Phases.fini() 2017-05-17 18:26:38.000: INFO: [BATTLE_OBSERVER_INFO] MOD shutting down: mod_battle_observer by Armagomen v1 #07-3 9.18 Aslains_WoT_Logs.zip
  4. Last .42 file deletes folder in res_mods

    Damn.. now I feel stupid :-) Thanks! Not enough coffee this morning...lol
  5. I ran the last file update .42 and it deletes the 0.9.18.0 folder causing the game not able to launch at startup. Says missing resource path. See attached files... Aslains_WoT_Logs.zip
  6. Shut down issues

    One of these mods prevents WoT from shutting down properly. I choose to end game, it exits to a blank screen. I have to CTRL-ALT-DEL..arrow down twice to log off. If I remove the mods, it shuts down just fine and back to desktop. Anyone else facing this? Been going on since about 3-4 Aslain updates ago. Aslains_WoT_Logs.zip
  7. 9.17.1 mod bugs

    During install, keep getting modsettings.dat exists error. Anyway to bypass this other than go into the APPDATA folder to delete or rename?
  8. Error with json.cache file

    Whenever I update to the latest version, 90% of the time I get an error regarding the json.cache file exists and it won't overwrite it. I literally have to go to the temp path to delete the file and hit "retry" to continue. The file error happens during the extraction process: C:\Users\*.*\AppData\Local\Temp\is-C1PC5.tmp\back_up\cache.json\cache.json\cache.json The path varies, but always in the APPDATA temp folder. Below is from the installer log "2016-10-19 11:52:42.681 Message box (Abort/Retry/Ignore): C:\Users\DEATHB~1\AppData\Local\Temp\is-C1PC5.tmp\back_up\cache.json\cache.json\cache.json\cache.json An error occurred while trying to create a file in the destination directory: Setup was unable to create the directory "C:\Users\DEATHB~1\AppData\Local\Temp\is-C1PC5.tmp\back_up\cache.json\cache.json\cache.json". Error 183: Cannot create a file when that file already exists. Click Retry to try again, Ignore to skip this file (not recommended), or Abort to cancel installation. 2016-10-19 11:53:03.664 User chose Retry. 2016-10-19 11:53:03.664 Dest filename: C:\Users\DEATHB~1\AppData\Local\Temp\is-C1PC5.tmp\back_up\cache.json\cache.json\cache.json\cache.json 2016-10-19 11:53:03.664 Time stamp of our file: 2016-10-14 14:58:28.684 2016-10-19 11:53:03.664 Installing the file."
  9. It's always recreated in the temp folder during stall. Once it fails, the file goes away if you abort or cancel.
  10. I can't install any of the previous ones now as I get the same error message from each version :-/ I've even ran it as admin.. same thing. Message box (Abort/Retry/Ignore): C:\Users\DEATHB~1\AppData\Local\Temp\is-LH3A4.tmp\back_up\cache.json\cache.json An error occurred while trying to create a file in the destination directory: Setup was unable to create the directory "C:\Users\DEATHB~1\AppData\Local\Temp\is-LH3A4.tmp\back_up\cache.json". Error 183: Cannot create a file when that file already exists. Click Retry to try again, Ignore to skip this file (not recommended), or Abort to cancel installation. 2016-10-08 17:44:02.746 User chose Abort. 2016-10-08 17:44:02.746 User canceled the installation process. 2016-10-08 17:44:02.746 Rolling back changes. Setup Log 2016-10-08 #003.txt Setup Log 2016-10-08 #004.txt
  11. Error msg in Hanger

    My client shows 0.9.15.2 when starting
  12. Error msg in Hanger

    With .20_01 (latest) I see the following error in the hanger load details: Error: ScriptLoader PRO v1.17: Error by executing script(s): mod_sight.pyc Check Python Logfile for detailed Informations [ D:/Games/World_of_Tanks/Python.log ] It does load, but when playing I lost the the ESC key function to return to garage or settings, etc. _Aslain_logs.zip python.log
  13. I used the installer to setup the mods, ran the game and all looked fine until the match loaded. The interface looks more like 1024x768 instead of 1920x1200. when I zoom, it looks to be the correct dimensions, unzoomed it's huge.
×